Reaction Details
TargetPenicillin-binding protein 2
LigandBDBM50218764
Substrate/Competitorn/a
Meas. Tech.ChEMBL_153656 (CHEMBL762721)
IC50>545000±n/a nM
Citation Chen, ZDemuth, TPWireko, FC Stereoselective synthesis and antibacterial evaluation of 4-amido-isothiazolidinone oxides. Bioorg Med Chem Lett11:2111-5 (2001) Penicillin-binding protein 2
Name:Penicillin-binding protein 2
Type:PROTEIN
Mol. Mass.:79295.25
Organism:Staphylococcus aureus
Description:ChEMBL_153530
Residue:716
BDBM50218764
NameBDBM50218764
Synonyms:CHEMBL67669
TypeSmall organic molecule
Emp. Form.C23H26N2O6S
Mol. Mass.458.527
SMILESCC(C)[C@@H](N1[S+]([O-])C[C@H](NC(=O)COc2ccccc2)C1=O)C(=O)OCc1ccccc1