Reaction Details
TargetPenicillin-binding protein 2
LigandBDBM50218765
Substrate/Competitorn/a
Meas. Tech.ChEMBL_153656 (CHEMBL762721)
IC50>663000±n/a nM
Citation Chen, ZDemuth, TPWireko, FC Stereoselective synthesis and antibacterial evaluation of 4-amido-isothiazolidinone oxides. Bioorg Med Chem Lett11:2111-5 (2001) Penicillin-binding protein 2
Name:Penicillin-binding protein 2
Type:PROTEIN
Mol. Mass.:79295.25
Organism:Staphylococcus aureus
Description:ChEMBL_153530
Residue:716
BDBM50218765
NameBDBM50218765
Synonyms:CHEMBL66962
TypeSmall organic molecule
Emp. Form.C13H13ClN2O7S
Mol. Mass.376.77
SMILESCC(N1C(=O)C(CS1(=O)=O)NC(=O)Oc1ccc(Cl)cc1)C(O)=O