Reaction Details
TargetPenicillin-binding protein 2
LigandBDBM50218771
Substrate/Competitorn/a
Meas. Tech.ChEMBL_153656 (CHEMBL762721)
IC50>552000±n/a nM
Citation Chen, ZDemuth, TPWireko, FC Stereoselective synthesis and antibacterial evaluation of 4-amido-isothiazolidinone oxides. Bioorg Med Chem Lett11:2111-5 (2001) Penicillin-binding protein 2
Name:Penicillin-binding protein 2
Type:PROTEIN
Mol. Mass.:79295.25
Organism:Staphylococcus aureus
Description:ChEMBL_153530
Residue:716
BDBM50218771
NameBDBM50218771
Synonyms:CHEMBL63749
TypeSmall organic molecule
Emp. Form.C19H17ClN2O7S
Mol. Mass.452.865
SMILESClc1ccc(OC(=O)NC2CS(=O)(=O)N(CC(=O)OCc3ccccc3)C2=O)cc1