Reaction Details
TargetPenicillin-binding protein 2
LigandBDBM50218772
Substrate/Competitorn/a
Meas. Tech.ChEMBL_153656 (CHEMBL762721)
IC50>567000±n/a nM
Citation Chen, ZDemuth, TPWireko, FC Stereoselective synthesis and antibacterial evaluation of 4-amido-isothiazolidinone oxides. Bioorg Med Chem Lett11:2111-5 (2001) Penicillin-binding protein 2
Name:Penicillin-binding protein 2
Type:PROTEIN
Mol. Mass.:79295.25
Organism:Staphylococcus aureus
Description:ChEMBL_153530
Residue:716
BDBM50218772
NameBDBM50218772
Synonyms:CHEMBL66853
TypeSmall organic molecule
Emp. Form.C20H28N2O7S
Mol. Mass.440.511
SMILESCC(C)C(N1C(=O)C(CS1(=O)=O)NC(=O)OCc1ccccc1)C(=O)OC(C)(C)C