Reaction Details
TargetPenicillin-binding protein 2
LigandBDBM50218766
Substrate/Competitorn/a
Meas. Tech.ChEMBL_153656 (CHEMBL762721)
IC50>780000±n/a nM
Citation Chen, ZDemuth, TPWireko, FC Stereoselective synthesis and antibacterial evaluation of 4-amido-isothiazolidinone oxides. Bioorg Med Chem Lett11:2111-5 (2001) Penicillin-binding protein 2
Name:Penicillin-binding protein 2
Type:PROTEIN
Mol. Mass.:79295.25
Organism:Staphylococcus aureus
Description:ChEMBL_153530
Residue:716
BDBM50218766
NameBDBM50218766
Synonyms:CHEMBL67473
TypeSmall organic molecule
Emp. Form.C16H20N2O5
Mol. Mass.320.3404
SMILESCC(C)[C@@H](N1C[C@H](NC(=O)COc2ccccc2)C1=O)C(O)=O