Reaction Details
TargetPenicillin-binding protein 2
LigandBDBM50218773
Substrate/Competitorn/a
Meas. Tech.ChEMBL_153656 (CHEMBL762721)
IC50>678000±n/a nM
Citation Chen, ZDemuth, TPWireko, FC Stereoselective synthesis and antibacterial evaluation of 4-amido-isothiazolidinone oxides. Bioorg Med Chem Lett11:2111-5 (2001) Penicillin-binding protein 2
Name:Penicillin-binding protein 2
Type:PROTEIN
Mol. Mass.:79295.25
Organism:Staphylococcus aureus
Description:ChEMBL_153530
Residue:716
BDBM50218773
NameBDBM50218773
Synonyms:CHEMBL432719
TypeSmall organic molecule
Emp. Form.C16H20N2O6S
Mol. Mass.368.405
SMILESCC(C)[C@@H](N1[S+]([O-])C[C@H](NC(=O)COc2ccccc2)C1=O)C(O)=O