Reaction Details
TargetThioredoxin reductase 3
LigandBDBM50218801
Substrate/Competitorn/a
Meas. Tech.ChEMBL_210563 (CHEMBL816515)
IC50 2100±n/a nM
Citation Wipf, PHopkins, TDJung, JKRodriguez, SBirmingham, ASouthwick, ECLazo, JSPowis, G New inhibitors of the thioredoxin-thioredoxin reductase system based on a naphthoquinone spiroketal natural product lead. Bioorg Med Chem Lett11:2637-41 (2001) Thioredoxin reductase 3
Name:Thioredoxin reductase 3
Type:PROTEIN
Mol. Mass.:70543.23
Organism:Homo sapiens (Human)
Description:ChEMBL_104858
Residue:642
BDBM50218801
NameBDBM50218801
Synonyms:CHEMBL89232
TypeSmall organic molecule
Emp. Form.C20H14O4
Mol. Mass.318.3228
SMILESO=C1CCCC2=C1C1(Oc3cccc4cccc(O1)c34)C=CC2=O