Reaction Details
TargetThioredoxin reductase 3
LigandBDBM50218804
Substrate/Competitorn/a
Meas. Tech.ChEMBL_210563 (CHEMBL816515)
IC50 4500±n/a nM
Citation Wipf, PHopkins, TDJung, JKRodriguez, SBirmingham, ASouthwick, ECLazo, JSPowis, G New inhibitors of the thioredoxin-thioredoxin reductase system based on a naphthoquinone spiroketal natural product lead. Bioorg Med Chem Lett11:2637-41 (2001) Thioredoxin reductase 3
Name:Thioredoxin reductase 3
Type:PROTEIN
Mol. Mass.:70543.23
Organism:Homo sapiens (Human)
Description:ChEMBL_104858
Residue:642
BDBM50218804
NameBDBM50218804
Synonyms:CHEMBL89475 | SCH-49209
TypeSmall organic molecule
Emp. Form.C20H14O7
Mol. Mass.366.321
SMILES[H][C@]12O[C@@]1([H])C1(Oc3cccc4cccc(O1)c34)[C@@]13O[C@@]1([C@@H](O)C=CC3=O)[C@H]2O