Reaction Details
TargetThioredoxin reductase 3
LigandBDBM50218850
Substrate/Competitorn/a
Meas. Tech.ChEMBL_210422 (CHEMBL811694)
IC50>50000±n/a nM
Citation Wipf, PHopkins, TDJung, JKRodriguez, SBirmingham, ASouthwick, ECLazo, JSPowis, G New inhibitors of the thioredoxin-thioredoxin reductase system based on a naphthoquinone spiroketal natural product lead. Bioorg Med Chem Lett11:2637-41 (2001) Thioredoxin reductase 3
Name:Thioredoxin reductase 3
Type:PROTEIN
Mol. Mass.:70543.23
Organism:Homo sapiens (Human)
Description:ChEMBL_104858
Residue:642
BDBM50218850
NameBDBM50218850
Synonyms:CHEMBL312843
TypeSmall organic molecule
Emp. Form.C32H19F3O5
Mol. Mass.540.4855
SMILESFC(F)(F)c1cccc(c1)-c1ccc(COc2cccc3c2C(=O)C=CC32Oc3cccc4cccc(O2)c34)o1