Reaction Details
Target5-hydroxytryptamine receptor 6
LigandBDBM50219081
Substrate/Competitorn/a
Meas. Tech.ChEMBL_3633 (CHEMBL619951)
Ki 0.630957±n/a nM
Citation Bromidge, SMGriffith, KHeightman, TDJennings, AKing, FDMoss, SFNewman, HRiley, GRoutledge, CSerafinowska, HTThomas, DR Novel (4-piperazin-1-ylquinolin-6-yl) arylsulfonamides with high affinity and selectivity for the 5-HT(6) receptor. Bioorg Med Chem Lett11:2843-6 (2001) 5-hydroxytryptamine receptor 6
Name:5-hydroxytryptamine receptor 6
Type:G Protein-Coupled Receptor (GPCR)
Mol. Mass.:46968.43
Organism:Homo sapiens (Human)
Description:P50406
Residue:440
BDBM50219081
NameBDBM50219081
Synonyms:CHEMBL261917
TypeSmall organic molecule
Emp. Form.C23H28N4O2S
Mol. Mass.424.559
SMILESCC(C)(C)c1ccc(cc1)S(=O)(=O)Nc1ccc2nccc(N3CCNCC3)c2c1