Reaction Details
Target5-hydroxytryptamine receptor 2A
LigandBDBM50219081
Substrate/Competitorn/a
Meas. Tech.ChEMBL_2520 (CHEMBL617253)
Ki<3162±n/a nM
Citation Bromidge, SMGriffith, KHeightman, TDJennings, AKing, FDMoss, SFNewman, HRiley, GRoutledge, CSerafinowska, HTThomas, DR Novel (4-piperazin-1-ylquinolin-6-yl) arylsulfonamides with high affinity and selectivity for the 5-HT(6) receptor. Bioorg Med Chem Lett11:2843-6 (2001) 5-hydroxytryptamine receptor 2A
Name:5-hydroxytryptamine receptor 2A
Type:undefined
Mol. Mass.:52607.65
Organism:Homo sapiens (Human)
Description:P28223
Residue:471
BDBM50219081
NameBDBM50219081
Synonyms:CHEMBL261917
TypeSmall organic molecule
Emp. Form.C23H28N4O2S
Mol. Mass.424.559
SMILESCC(C)(C)c1ccc(cc1)S(=O)(=O)Nc1ccc2nccc(N3CCNCC3)c2c1