Reaction Details
Target5-hydroxytryptamine receptor 6
LigandBDBM50219096
Substrate/Competitorn/a
Meas. Tech.ChEMBL_3633 (CHEMBL619951)
Ki 1.6±n/a nM
Citation Bromidge, SMGriffith, KHeightman, TDJennings, AKing, FDMoss, SFNewman, HRiley, GRoutledge, CSerafinowska, HTThomas, DR Novel (4-piperazin-1-ylquinolin-6-yl) arylsulfonamides with high affinity and selectivity for the 5-HT(6) receptor. Bioorg Med Chem Lett11:2843-6 (2001) 5-hydroxytryptamine receptor 6
Name:5-hydroxytryptamine receptor 6
Type:G Protein-Coupled Receptor (GPCR)
Mol. Mass.:46968.43
Organism:Homo sapiens (Human)
Description:P50406
Residue:440
BDBM50219096
NameBDBM50219096
Synonyms:CHEMBL99982
TypeSmall organic molecule
Emp. Form.C24H25ClN4O2S2
Mol. Mass.501.064
SMILESCC(C)c1c(sc2ccc(Cl)cc12)S(=O)(=O)Nc1ccc2nccc(N3CCNCC3)c2c1