Reaction Details
TargetMuscarinic acetylcholine receptor M1
LigandBDBM81452
Substrate/Competitorn/a
Meas. Tech.ChEMBL_138539 (CHEMBL746257)
Ki 263±n/a nM
Citation Böhme, TMKeim, CDannhardt, GMutschler, ELambrecht, G Design and pharmacology of quinuclidine derivatives as M2-selective muscarinic receptor ligands. Bioorg Med Chem Lett11:1241-3 (2001) Muscarinic acetylcholine receptor M1
Name:Muscarinic acetylcholine receptor M1
Type:Protein
Mol. Mass.:51442.54
Organism:Homo sapiens (Human)
Description:P11229
Residue:460
BDBM81452
NameBDBM81452
Synonyms:CAS_91533 NSC_91533
TypeSmall organic molecule
Emp. Form.C20H24N2
Mol. Mass.292.418
SMILESCC(C1=C(CCN(C)C)Cc2ccccc12)c1ccccn1