Reaction Details
TargetMuscarinic acetylcholine receptor M4
LigandBDBM81452
Substrate/Competitorn/a
Meas. Tech.ChEMBL_139240 (CHEMBL746455)
Ki 407±n/a nM
Citation Böhme, TMKeim, CDannhardt, GMutschler, ELambrecht, G Design and pharmacology of quinuclidine derivatives as M2-selective muscarinic receptor ligands. Bioorg Med Chem Lett11:1241-3 (2001) Muscarinic acetylcholine receptor M4
Name:Muscarinic acetylcholine receptor M4
Type:Enzyme Catalytic Domain
Mol. Mass.:53079.31
Organism:Homo sapiens (Human)
Description:Cholinergic, muscarinic M4 CHRM4 HUMAN M3::P08173
Residue:479
BDBM81452
NameBDBM81452
Synonyms:CAS_91533 NSC_91533
TypeSmall organic molecule
Emp. Form.C20H24N2
Mol. Mass.292.418
SMILESCC(C1=C(CCN(C)C)Cc2ccccc12)c1ccccn1