Reaction Details
TargetcAMP-specific 3',5'-cyclic phosphodiesterase 4A/4B/4C/4D
LigandBDBM50346088
Substrate/Competitorn/a
Meas. Tech.ChEMBL_157065 (CHEMBL764847)
Ki 38±n/a nM
Citation Napoletano, MNorcini, GPellacini, FMarchini, FMorazzoni, GFattori, RFerlenga, PPradella, L Phthalazine PDE4 inhibitors. Part 3: the synthesis and in vitro evaluation of derivatives with a hydrogen bond acceptor. Bioorg Med Chem Lett12:5-8 (2002) cAMP-specific 3',5'-cyclic phosphodiesterase 4A/4B/4C/4D
Name:cAMP-specific 3',5'-cyclic phosphodiesterase 4A/4B/4C/4D
Synonyms:Phosphodiesterase 4
Type:n/a
Mol. Mass.:n/a
Description:ASSAY_ID of ChEMBL is 788178
Components:This complex has 4 components.
Component 1
Name:cAMP-specific 3',5'-cyclic phosphodiesterase 4A
Type:Enzyme
Mol. Mass.:98113.27
Organism:Homo sapiens (Human)
Description:P27815
Residue:886
Component 2
Name:cAMP-specific 3',5'-cyclic phosphodiesterase 4D
Synonyms:3',5'-cyclic phosphodiesterase PDE43 PDE4D_HUMAN | Phosphodiesterase 4D
Type:Protein
Mol. Mass.:91092.69
Organism:Homo sapiens (Human)
Description:Q08499
Residue:809
Component 3
Name:cAMP-specific 3',5'-cyclic phosphodiesterase 4B
Synonyms:3',5'-cyclic phosphodiesterase Isoform PDE4B1 PDE4B PDE4B_HUMAN Phosphodiesterase 4B (PDE4B) Phosphodiesterase Type 4 (PDE4B)
Type:Protein
Mol. Mass.:83318.87
Organism:Homo sapiens (Human)
Description:Q07343
Residue:736
Component 4
Name:cAMP-specific 3',5'-cyclic phosphodiesterase 4C
Synonyms:3',5'-cyclic phosphodiesterase NP_000914.2 PDE4C | PDE4C1
Type:Enzyme Catalytic Domain
Mol. Mass.:79875.54
Organism:Homo sapiens (Human)
Description:Q08493
Residue:712
BDBM50346088
NameBDBM50346088
Synonyms:(1r,4r)-4-cyano-4-(3-(cyclopentyloxy)-4-methoxyphenyl)cyclohexanecarboxylic acid 4-Cyano-4-(3-cyclopentyloxy-4-methoxy-phenyl)-cyclohexanecarboxylic acid 4-Cyano-4-(3-cyclopentyloxy-4-methoxy-phenyl)-cyclohexanecarboxylic acid methyl ester 6-(3,4-Dimethoxy-phenyl)-5-methyl-4,5-dihydro-2H-pyridazin-3-one CHEMBL511115 | SB-207499
TypeSmall organic molecule
Emp. Form.C20H25NO4
Mol. Mass.343.4168
SMILESCOc1ccc(cc1OC1CCCC1)[C@]1(CC[C@@H](CC1)C(O)=O)C#N