Reaction Details
Target5-hydroxytryptamine receptor 1E
LigandBDBM50130286
Substrate/Competitorn/a
Meas. Tech.ChEMBL_2068 (CHEMBL616712)
Ki 2512±n/a nM
Citation Bromidge, SMClarke, SEKing, FDLovell, PJNewman, HRiley, GRoutledge, CSerafinowska, HTSmith, DRThomas, DR Bicyclic piperazinylbenzenesulphonamides are potent and selective 5-HT6 receptor antagonists. Bioorg Med Chem Lett12:1357-60 (2002) 5-hydroxytryptamine receptor 1E
Name:5-hydroxytryptamine receptor 1E
Type:G Protein-Coupled Receptor (GPCR)
Mol. Mass.:41697.80
Organism:Homo sapiens (Human)
Description:gi_112822
Residue:365
BDBM50130286
NameBDBM50130286
Synonyms:5-Chloro-3-methyl-benzo[b]thiophene-2-sulfonic acid [4-methoxy-3-(4-methyl-piperazin-1-yl)-phenyl]-amide SB-258510
TypeSmall organic molecule
Emp. Form.C21H24ClN3O3S2
Mol. Mass.466.017
SMILESCOc1ccc(NS(=O)(=O)c2sc3ccc(Cl)cc3c2C)cc1N1CCN(C)CC1