Reaction Details
Target5-hydroxytryptamine receptor 2B
LigandBDBM50001824
Substrate/Competitorn/a
Meas. Tech.ChEMBL_2894 (CHEMBL617612)
Ki 1259±n/a nM
Citation Bromidge, SMClarke, SEKing, FDLovell, PJNewman, HRiley, GRoutledge, CSerafinowska, HTSmith, DRThomas, DR Bicyclic piperazinylbenzenesulphonamides are potent and selective 5-HT6 receptor antagonists. Bioorg Med Chem Lett12:1357-60 (2002) 5-hydroxytryptamine receptor 2B
Name:5-hydroxytryptamine receptor 2B
Type:G Protein-Coupled Receptor (GPCR)
Mol. Mass.:54312.47
Organism:Homo sapiens (Human)
Description:Receptor binding assays were performed using human clone stably expressed in CHO cells.
Residue:481
BDBM50001824
NameBDBM50001824
Synonyms:CHEMBL282971
TypeSmall organic molecule
Emp. Form.C23H26ClN3O3S2
Mol. Mass.492.054
SMILES[H][C@]12CCCN1CCN(C2)c1cc(NS(=O)(=O)c2sc3ccc(Cl)cc3c2C)ccc1OC