Reaction Details
Target5-hydroxytryptamine receptor 1E
LigandBDBM50001824
Substrate/Competitorn/a
Meas. Tech.ChEMBL_2068 (CHEMBL616712)
Ki 1000±n/a nM
Citation Bromidge, SMClarke, SEKing, FDLovell, PJNewman, HRiley, GRoutledge, CSerafinowska, HTSmith, DRThomas, DR Bicyclic piperazinylbenzenesulphonamides are potent and selective 5-HT6 receptor antagonists. Bioorg Med Chem Lett12:1357-60 (2002) 5-hydroxytryptamine receptor 1E
Name:5-hydroxytryptamine receptor 1E
Type:G Protein-Coupled Receptor (GPCR)
Mol. Mass.:41697.80
Organism:Homo sapiens (Human)
Description:gi_112822
Residue:365
BDBM50001824
NameBDBM50001824
Synonyms:CHEMBL282971
TypeSmall organic molecule
Emp. Form.C23H26ClN3O3S2
Mol. Mass.492.054
SMILES[H][C@]12CCCN1CCN(C2)c1cc(NS(=O)(=O)c2sc3ccc(Cl)cc3c2C)ccc1OC