Reaction Details
Target5-hydroxytryptamine receptor 7
LigandBDBM50130270
Substrate/Competitorn/a
Meas. Tech.ChEMBL_3732 (CHEMBL620733)
Ki 1000±n/a nM
Citation Bromidge, SMClarke, SEKing, FDLovell, PJNewman, HRiley, GRoutledge, CSerafinowska, HTSmith, DRThomas, DR Bicyclic piperazinylbenzenesulphonamides are potent and selective 5-HT6 receptor antagonists. Bioorg Med Chem Lett12:1357-60 (2002) 5-hydroxytryptamine receptor 7
Name:5-hydroxytryptamine receptor 7
Type:G Protein-Coupled Receptor (GPCR)
Mol. Mass.:53573.08
Organism:Homo sapiens (Human)
Description:P34969
Residue:479
BDBM50130270
NameBDBM50130270
Synonyms:5-Chloro-3-methyl-benzo[b]thiophene-2-sulfonic acid ((S)-3-hexahydro-pyrrolo[1,2-a]pyrazin-2-yl-4-methoxy-phenyl)-amide CHEMBL29433
TypeSmall organic molecule
Emp. Form.C23H26ClN3O3S2
Mol. Mass.492.054
SMILESCOc1ccc(NS(=O)(=O)c2sc3ccc(Cl)cc3c2C)cc1N1CCN2CCC[C@H]2C1