Reaction Details
Target5-hydroxytryptamine receptor 4
LigandBDBM50130286
Substrate/Competitorn/a
Meas. Tech.ChEMBL_3309 (CHEMBL619010)
Ki 3162±n/a nM
Citation Bromidge, SMClarke, SEKing, FDLovell, PJNewman, HRiley, GRoutledge, CSerafinowska, HTSmith, DRThomas, DR Bicyclic piperazinylbenzenesulphonamides are potent and selective 5-HT6 receptor antagonists. Bioorg Med Chem Lett12:1357-60 (2002) 5-hydroxytryptamine receptor 4
Name:5-hydroxytryptamine receptor 4
Type:Enzyme
Mol. Mass.:43767.54
Organism:Homo sapiens (Human)
Description:Q13639
Residue:388
BDBM50130286
NameBDBM50130286
Synonyms:5-Chloro-3-methyl-benzo[b]thiophene-2-sulfonic acid [4-methoxy-3-(4-methyl-piperazin-1-yl)-phenyl]-amide SB-258510
TypeSmall organic molecule
Emp. Form.C21H24ClN3O3S2
Mol. Mass.466.017
SMILESCOc1ccc(NS(=O)(=O)c2sc3ccc(Cl)cc3c2C)cc1N1CCN(C)CC1