Reaction Details
TargetD(3) dopamine receptor
LigandBDBM50001824
Substrate/Competitorn/a
Meas. Tech.ChEMBL_62605 (CHEMBL858401)
Ki 631±n/a nM
Citation Bromidge, SMClarke, SEKing, FDLovell, PJNewman, HRiley, GRoutledge, CSerafinowska, HTSmith, DRThomas, DR Bicyclic piperazinylbenzenesulphonamides are potent and selective 5-HT6 receptor antagonists. Bioorg Med Chem Lett12:1357-60 (2002) D(3) dopamine receptor
Name:D(3) dopamine receptor
Type:n/a
Mol. Mass.:44243.43
Organism:Homo sapiens (Human)
Description:n/a
Residue:400
BDBM50001824
NameBDBM50001824
Synonyms:CHEMBL282971
TypeSmall organic molecule
Emp. Form.C23H26ClN3O3S2
Mol. Mass.492.054
SMILES[H][C@]12CCCN1CCN(C2)c1cc(NS(=O)(=O)c2sc3ccc(Cl)cc3c2C)ccc1OC