Reaction Details
TargetcAMP-specific 3',5'-cyclic phosphodiesterase 4C
LigandBDBM14361
Substrate/Competitorn/a
Meas. Tech.ChEMBL_157216 (CHEMBL769540)
IC50 20±n/a nM
Citation Buckley, GMCooper, NDyke, HJGalleway, FPGowers, LHaughan, AFKendall, HJLowe, CMaxey, RMontana, JGNaylor, ROxford, JPeake, JCPicken, CLRuncie, KASabin, VSharpe, AWarneck, JB 8-Methoxyquinoline-5-carboxamides as PDE4 inhibitors: a potential treatment for asthma. Bioorg Med Chem Lett12:1613-5 (2002) cAMP-specific 3',5'-cyclic phosphodiesterase 4C
Name:cAMP-specific 3',5'-cyclic phosphodiesterase 4C
Type:PROTEIN
Mol. Mass.:60038.21
Organism:Rattus norvegicus
Description:ChEMBL_104732
Residue:536
BDBM14361
NameBDBM14361
Synonyms:(R,S)-Rolipram 4-[3-(cyclopentyloxy)-4-methoxyphenyl]pyrrolidin-2-one CHEMBL63 | Rolipram
TypeSmall organic molecule
Emp. Form.C16H21NO3
Mol. Mass.275.3428
SMILESCOc1ccc(cc1OC1CCCC1)C1CNC(=O)C1