Reaction Details
TargetcAMP-specific 3',5'-cyclic phosphodiesterase 4C
LigandBDBM50218255
Substrate/Competitorn/a
Meas. Tech.ChEMBL_157216 (CHEMBL769540)
IC50 20±n/a nM
Citation Buckley, GMCooper, NDyke, HJGalleway, FPGowers, LHaughan, AFKendall, HJLowe, CMaxey, RMontana, JGNaylor, ROxford, JPeake, JCPicken, CLRuncie, KASabin, VSharpe, AWarneck, JB 8-Methoxyquinoline-5-carboxamides as PDE4 inhibitors: a potential treatment for asthma. Bioorg Med Chem Lett12:1613-5 (2002) cAMP-specific 3',5'-cyclic phosphodiesterase 4C
Name:cAMP-specific 3',5'-cyclic phosphodiesterase 4C
Type:PROTEIN
Mol. Mass.:60038.21
Organism:Rattus norvegicus
Description:ChEMBL_104732
Residue:536
BDBM50218255
NameBDBM50218255
Synonyms:CHEMBL290100
TypeSmall organic molecule
Emp. Form.C17H12Cl2N2O4
Mol. Mass.379.194
SMILESCOc1ccc(C(=O)Nc2c(Cl)cncc2Cl)c2cc(oc12)C(C)=O