Reaction Details
TargetNeuraminidase
LigandBDBM50219991
Substrate/Competitorn/a
Meas. Tech.ChEMBL_200640 (CHEMBL802974)
IC50 28.7±n/a nM
Citation Honda, TMasuda, TYoshida, SArai, MKaneko, SYamashita, M Synthesis and anti-influenza virus activity of 7-O-alkylated derivatives related to zanamivir. Bioorg Med Chem Lett12:1925-8 (2002) Neuraminidase
Name:Neuraminidase
Type:Enzyme
Mol. Mass.:50124.14
Organism:Influenza A virus (A/Puerto Rico/8/34/Mount Sinai(H1N1))
Description:P03468
Residue:454
BDBM50219991
NameBDBM50219991
Synonyms:CHEMBL61018
TypeSmall organic molecule
Emp. Form.C16H24F3N7O9
Mol. Mass.515.3985
SMILESOC(=O)C(F)(F)F.[H][C@]1(OC(=C[C@H](NC(N)=N)[C@H]1NC(C)=O)C(O)=O)[C@H](OCCN=[N+]=[N-])[C@H](O)CO