Reaction Details
TargetNeuraminidase
LigandBDBM50219998
Substrate/Competitorn/a
Meas. Tech.ChEMBL_200640 (CHEMBL802974)
IC50 67.5±n/a nM
Citation Honda, TMasuda, TYoshida, SArai, MKaneko, SYamashita, M Synthesis and anti-influenza virus activity of 7-O-alkylated derivatives related to zanamivir. Bioorg Med Chem Lett12:1925-8 (2002) Neuraminidase
Name:Neuraminidase
Type:Enzyme
Mol. Mass.:50124.14
Organism:Influenza A virus (A/Puerto Rico/8/34/Mount Sinai(H1N1))
Description:P03468
Residue:454
BDBM50219998
NameBDBM50219998
Synonyms:CHEMBL291455
TypeSmall organic molecule
Emp. Form.C21H33F3N4O9
Mol. Mass.542.5033
SMILESOC(=O)C(F)(F)F.[H][C@]1(OC(=C[C@H](NC(N)=N)[C@H]1NC(C)=O)C(O)=O)[C@H](OCC1CCCCC1)[C@H](O)CO