Reaction Details
TargetHistamine H2 receptor
LigandBDBM50220071
Substrate/Competitorn/a
Meas. Tech.ChEBML_85661
Ki 12303±n/a nM
Citation Faghih, RDwight, WGentles, RPhelan, KEsbenshade, TAIreland, LMiller, TRKang, CHFox, GBGopalakrishnan, SMHancock, AABennani, YL Structure-activity relationships of non-imidazole H(3) receptor ligands. Part 1. Bioorg Med Chem Lett12:2031-4 (2002) Histamine H2 receptor
Name:Histamine H2 receptor
Type:G Protein-Coupled Receptor (GPCR)
Mol. Mass.:40115.31
Organism:Homo sapiens (Human)
Description:n/a
Residue:359
BDBM50220071
NameBDBM50220071
Synonyms:CHEMBL294519
TypeSmall organic molecule
Emp. Form.C26H34N2O3
Mol. Mass.422.5598
SMILESCCCCCC(=O)c1ccc(OCCCN2CCN(CC2)C(=O)c2ccccc2)cc1