Reaction Details
TargetHistamine H3 receptor
LigandBDBM50220333
Substrate/Competitorn/a
Meas. Tech.ChEBML_87054
Ki 5.0±n/a nM
Citation Faghih, RDwight, WGentles, RPhelan, KEsbenshade, TAIreland, LMiller, TRKang, CHFox, GBGopalakrishnan, SMHancock, AABennani, YL Structure-activity relationships of non-imidazole H(3) receptor ligands. Part 1. Bioorg Med Chem Lett12:2031-4 (2002) Histamine H3 receptor
Name:Histamine H3 receptor
Type:G Protein-Coupled Receptor (GPCR)
Mol. Mass.:48607.98
Organism:Rattus norvegicus (rat)
Description:n/a
Residue:445
BDBM50220333
NameBDBM50220333
Synonyms:CHEMBL64259
TypeSmall organic molecule
Emp. Form.C23H36N2O4
Mol. Mass.404.5429
SMILESCCCCCC(=O)c1ccc(OCCCN2CCN(CC2)C(=O)OC(C)C)cc1