Reaction Details
TargetHistamine H2 receptor
LigandBDBM50220113
Substrate/Competitorn/a
Meas. Tech.ChEBML_85661
Ki 39811±n/a nM
Citation Faghih, RDwight, WGentles, RPhelan, KEsbenshade, TAIreland, LMiller, TRKang, CHFox, GBGopalakrishnan, SMHancock, AABennani, YL Structure-activity relationships of non-imidazole H(3) receptor ligands. Part 1. Bioorg Med Chem Lett12:2031-4 (2002) Histamine H2 receptor
Name:Histamine H2 receptor
Type:G Protein-Coupled Receptor (GPCR)
Mol. Mass.:40115.31
Organism:Homo sapiens (Human)
Description:n/a
Residue:359
BDBM50220113
NameBDBM50220113
Synonyms:CHEMBL62840
TypeSmall organic molecule
Emp. Form.C18H26N2O4
Mol. Mass.334.41
SMILESCCOC(=O)N1CCN(CCCOc2ccc(cc2)C(C)=O)CC1