Reaction Details
TargetHistamine H2 receptor
LigandBDBM50220395
Substrate/Competitorn/a
Meas. Tech.ChEBML_85661
Ki 22387±n/a nM
Citation Faghih, RDwight, WGentles, RPhelan, KEsbenshade, TAIreland, LMiller, TRKang, CHFox, GBGopalakrishnan, SMHancock, AABennani, YL Structure-activity relationships of non-imidazole H(3) receptor ligands. Part 1. Bioorg Med Chem Lett12:2031-4 (2002) Histamine H2 receptor
Name:Histamine H2 receptor
Type:G Protein-Coupled Receptor (GPCR)
Mol. Mass.:40115.31
Organism:Homo sapiens (Human)
Description:n/a
Residue:359
BDBM50220395
NameBDBM50220395
Synonyms:CHEMBL264761
TypeSmall organic molecule
Emp. Form.C20H28N2O4
Mol. Mass.360.4473
SMILESCCOC(=O)N1CCN(CCCOc2ccc(cc2)C(=O)C(C)=C)CC1