Reaction Details
TargetHistamine H3 receptor
LigandBDBM50220115
Substrate/Competitorn/a
Meas. Tech.ChEBML_87054
Ki 13±n/a nM
Citation Faghih, RDwight, WGentles, RPhelan, KEsbenshade, TAIreland, LMiller, TRKang, CHFox, GBGopalakrishnan, SMHancock, AABennani, YL Structure-activity relationships of non-imidazole H(3) receptor ligands. Part 1. Bioorg Med Chem Lett12:2031-4 (2002) Histamine H3 receptor
Name:Histamine H3 receptor
Type:G Protein-Coupled Receptor (GPCR)
Mol. Mass.:48607.98
Organism:Rattus norvegicus (rat)
Description:n/a
Residue:445
BDBM50220115
NameBDBM50220115
Synonyms:CHEMBL64247
TypeSmall organic molecule
Emp. Form.C27H36N2O4
Mol. Mass.452.5857
SMILESCCOC(=O)N1CCN(CCCOc2ccc(cc2)C(=O)c2ccc(cc2)C(C)(C)C)CC1