Reaction Details
TargetHistamine H3 receptor
LigandBDBM50220411
Substrate/Competitorn/a
Meas. Tech.ChEBML_87054
Ki 30±n/a nM
Citation Faghih, RDwight, WGentles, RPhelan, KEsbenshade, TAIreland, LMiller, TRKang, CHFox, GBGopalakrishnan, SMHancock, AABennani, YL Structure-activity relationships of non-imidazole H(3) receptor ligands. Part 1. Bioorg Med Chem Lett12:2031-4 (2002) Histamine H3 receptor
Name:Histamine H3 receptor
Type:G Protein-Coupled Receptor (GPCR)
Mol. Mass.:48607.98
Organism:Rattus norvegicus (rat)
Description:n/a
Residue:445
BDBM50220411
NameBDBM50220411
Synonyms:CHEMBL291882
TypeSmall organic molecule
Emp. Form.C24H31ClN2O3S
Mol. Mass.463.033
SMILESCCCCCC(=O)c1ccc(OCCCN2CCN(CC2)C(=O)c2sccc2Cl)cc1