Reaction Details
TargetHistamine H3 receptor
LigandBDBM50220403
Substrate/Competitorn/a
Meas. Tech.ChEBML_87054
Ki 4.7±n/a nM
Citation Faghih, RDwight, WGentles, RPhelan, KEsbenshade, TAIreland, LMiller, TRKang, CHFox, GBGopalakrishnan, SMHancock, AABennani, YL Structure-activity relationships of non-imidazole H(3) receptor ligands. Part 1. Bioorg Med Chem Lett12:2031-4 (2002) Histamine H3 receptor
Name:Histamine H3 receptor
Type:G Protein-Coupled Receptor (GPCR)
Mol. Mass.:48607.98
Organism:Rattus norvegicus (rat)
Description:n/a
Residue:445
BDBM50220403
NameBDBM50220403
Synonyms:CHEMBL62948
TypeSmall organic molecule
Emp. Form.C20H28N2O4
Mol. Mass.360.4473
SMILESCCOC(=O)N1CCN(CCCOc2ccc(cc2)C(=O)C2CC2)CC1