Reaction Details
TargetHistamine H3 receptor
LigandBDBM50220409
Substrate/Competitorn/a
Meas. Tech.ChEBML_87054
Ki 13±n/a nM
Citation Faghih, RDwight, WGentles, RPhelan, KEsbenshade, TAIreland, LMiller, TRKang, CHFox, GBGopalakrishnan, SMHancock, AABennani, YL Structure-activity relationships of non-imidazole H(3) receptor ligands. Part 1. Bioorg Med Chem Lett12:2031-4 (2002) Histamine H3 receptor
Name:Histamine H3 receptor
Type:G Protein-Coupled Receptor (GPCR)
Mol. Mass.:48607.98
Organism:Rattus norvegicus (rat)
Description:n/a
Residue:445
BDBM50220409
NameBDBM50220409
Synonyms:CHEMBL63631
TypeSmall organic molecule
Emp. Form.C22H36N2O4S
Mol. Mass.424.597
SMILESCCCCCC(=O)c1ccc(OCCCN2CCN(CC2)S(=O)(=O)C(C)C)cc1