Reaction Details
TargetHistamine H3 receptor
LigandBDBM50220407
Substrate/Competitorn/a
Meas. Tech.ChEMBL_87054 (CHEMBL697327)
Ki 10±n/a nM
Citation Faghih, RDwight, WGentles, RPhelan, KEsbenshade, TAIreland, LMiller, TRKang, CHFox, GBGopalakrishnan, SMHancock, AABennani, YL Structure-activity relationships of non-imidazole H(3) receptor ligands. Part 1. Bioorg Med Chem Lett12:2031-4 (2002) Histamine H3 receptor
Name:Histamine H3 receptor
Type:G Protein-Coupled Receptor (GPCR)
Mol. Mass.:48607.98
Organism:Rattus norvegicus (rat)
Description:n/a
Residue:445
BDBM50220407
NameBDBM50220407
Synonyms:CHEMBL305338
TypeSmall organic molecule
Emp. Form.C27H36N2O3
Mol. Mass.436.5863
SMILESCCCCCC(=O)c1ccc(OCCCN2CCN(CC2)C(=O)Cc2ccccc2)cc1