Reaction Details
TargetHistamine H3 receptor
LigandBDBM50220340
Substrate/Competitorn/a
Meas. Tech.ChEMBL_87054 (CHEMBL697327)
Ki 6.5±n/a nM
Citation Faghih, RDwight, WGentles, RPhelan, KEsbenshade, TAIreland, LMiller, TRKang, CHFox, GBGopalakrishnan, SMHancock, AABennani, YL Structure-activity relationships of non-imidazole H(3) receptor ligands. Part 1. Bioorg Med Chem Lett12:2031-4 (2002) Histamine H3 receptor
Name:Histamine H3 receptor
Type:G Protein-Coupled Receptor (GPCR)
Mol. Mass.:48607.98
Organism:Rattus norvegicus (rat)
Description:n/a
Residue:445
BDBM50220340
NameBDBM50220340
Synonyms:CHEMBL64479
TypeSmall organic molecule
Emp. Form.C23H36N2O3
Mol. Mass.388.5435
SMILESCCCCCC(=O)c1ccc(OCCCN2CCN(CC2)C(=O)CCC)cc1