Reaction Details
TargetHistamine H2 receptor
LigandBDBM50220412
Substrate/Competitorn/a
Meas. Tech.ChEMBL_85661 (CHEMBL702652)
Ki 12589±n/a nM
Citation Faghih, RDwight, WGentles, RPhelan, KEsbenshade, TAIreland, LMiller, TRKang, CHFox, GBGopalakrishnan, SMHancock, AABennani, YL Structure-activity relationships of non-imidazole H(3) receptor ligands. Part 1. Bioorg Med Chem Lett12:2031-4 (2002) Histamine H2 receptor
Name:Histamine H2 receptor
Type:G Protein-Coupled Receptor (GPCR)
Mol. Mass.:40115.31
Organism:Homo sapiens (Human)
Description:n/a
Residue:359
BDBM50220412
NameBDBM50220412
Synonyms:CHEMBL64799
TypeSmall organic molecule
Emp. Form.C24H30N2O4
Mol. Mass.410.506
SMILESCCOC(=O)N1CCN(CCCOc2ccc(cc2)C(=O)Cc2ccccc2)CC1