Reaction Details
TargetHistamine H3 receptor
LigandBDBM50220103
Substrate/Competitorn/a
Meas. Tech.ChEMBL_87054 (CHEMBL697327)
Ki 21±n/a nM
Citation Faghih, RDwight, WGentles, RPhelan, KEsbenshade, TAIreland, LMiller, TRKang, CHFox, GBGopalakrishnan, SMHancock, AABennani, YL Structure-activity relationships of non-imidazole H(3) receptor ligands. Part 1. Bioorg Med Chem Lett12:2031-4 (2002) Histamine H3 receptor
Name:Histamine H3 receptor
Type:G Protein-Coupled Receptor (GPCR)
Mol. Mass.:48607.98
Organism:Rattus norvegicus (rat)
Description:n/a
Residue:445
BDBM50220103
NameBDBM50220103
Synonyms:CHEMBL431172
TypeSmall organic molecule
Emp. Form.C20H32N2O4S
Mol. Mass.396.544
SMILESCCCCCC(=O)c1ccc(OCCCN2CCN(CC2)S(C)(=O)=O)cc1