Reaction Details
TargetHistamine H2 receptor
LigandBDBM50220407
Substrate/Competitorn/a
Meas. Tech.ChEMBL_85661 (CHEMBL702652)
Ki 8913±n/a nM
Citation Faghih, RDwight, WGentles, RPhelan, KEsbenshade, TAIreland, LMiller, TRKang, CHFox, GBGopalakrishnan, SMHancock, AABennani, YL Structure-activity relationships of non-imidazole H(3) receptor ligands. Part 1. Bioorg Med Chem Lett12:2031-4 (2002) Histamine H2 receptor
Name:Histamine H2 receptor
Type:G Protein-Coupled Receptor (GPCR)
Mol. Mass.:40115.31
Organism:Homo sapiens (Human)
Description:n/a
Residue:359
BDBM50220407
NameBDBM50220407
Synonyms:CHEMBL305338
TypeSmall organic molecule
Emp. Form.C27H36N2O3
Mol. Mass.436.5863
SMILESCCCCCC(=O)c1ccc(OCCCN2CCN(CC2)C(=O)Cc2ccccc2)cc1