Reaction Details
TargetSubstance-P receptor
LigandBDBM50220505
Substrate/Competitorn/a
Meas. Tech.ChEMBL_205898 (CHEMBL814482)
Ki 245±n/a nM
Citation Bleicher, KHWüthrich, YDe Boni, MKolczewski, SHoffmann, TSleight, AJ Parallel solution- and solid-phase synthesis of spirohydantoin derivatives as neurokinin-1 receptor ligands. Bioorg Med Chem Lett12:2519-22 (2002) Substance-P receptor
Name:Substance-P receptor
Type:G Protein-Coupled Receptor (GPCR)
Mol. Mass.:46254.43
Organism:Homo sapiens (Human)
Description:P25103
Residue:407
BDBM50220505
NameBDBM50220505
Synonyms:CHEMBL84761
TypeSmall organic molecule
Emp. Form.C24H19F6N3O5
Mol. Mass.543.4152
SMILESFC(F)(F)c1cc(cc(c1)C(F)(F)F)C(=O)N1CCC2(CC1)NC(=O)N(Cc1ccc3OCOc3c1)C2=O