Reaction Details
TargetSubstance-P receptor
LigandBDBM50220513
Substrate/Competitorn/a
Meas. Tech.ChEMBL_205898 (CHEMBL814482)
Ki 646±n/a nM
Citation Bleicher, KHWüthrich, YDe Boni, MKolczewski, SHoffmann, TSleight, AJ Parallel solution- and solid-phase synthesis of spirohydantoin derivatives as neurokinin-1 receptor ligands. Bioorg Med Chem Lett12:2519-22 (2002) Substance-P receptor
Name:Substance-P receptor
Type:G Protein-Coupled Receptor (GPCR)
Mol. Mass.:46254.43
Organism:Homo sapiens (Human)
Description:P25103
Residue:407
BDBM50220513
NameBDBM50220513
Synonyms:CHEMBL82065
TypeSmall organic molecule
Emp. Form.C24H19Cl2F6N3O3
Mol. Mass.582.322
SMILESCN1C(=O)N(Cc2cc(cc(c2)C(F)(F)F)C(F)(F)F)C2(CCN(CC2)C(=O)c2c(Cl)cccc2Cl)C1=O