Reaction Details
TargetSubstance-P receptor
LigandBDBM50220515
Substrate/Competitorn/a
Meas. Tech.ChEMBL_205898 (CHEMBL814482)
Ki 2042±n/a nM
Citation Bleicher, KHWüthrich, YDe Boni, MKolczewski, SHoffmann, TSleight, AJ Parallel solution- and solid-phase synthesis of spirohydantoin derivatives as neurokinin-1 receptor ligands. Bioorg Med Chem Lett12:2519-22 (2002) Substance-P receptor
Name:Substance-P receptor
Type:G Protein-Coupled Receptor (GPCR)
Mol. Mass.:46254.43
Organism:Homo sapiens (Human)
Description:P25103
Residue:407
BDBM50220515
NameBDBM50220515
Synonyms:CHEMBL82274
TypeSmall organic molecule
Emp. Form.C24H29F6N3O3
Mol. Mass.521.4958
SMILESCCCCCCCCN1C(=O)NC2(CCN(CC2)C(=O)c2cc(cc(c2)C(F)(F)F)C(F)(F)F)C1=O