Reaction Details
TargetProthrombin
LigandBDBM50100967
Substrate/Competitorn/a
Meas. Tech.ChEMBL_209399 (CHEMBL811331)
Ki 1318±n/a nM
Citation Cui, JJAraldi, GLReiner, JEReddy, KMKemp, SJHo, JZSiev, DVMamedova, LGibson, TSGaudette, JAMinami, NKAnderson, SMBradbury, AENolan, TGSemple, JE Non-covalent thrombin inhibitors featuring P3-heterocycles with P1-bicyclic arginine surrogates. Bioorg Med Chem Lett12:2925-30 (2002) Prothrombin
Name:Prothrombin
Type:Protein
Mol. Mass.:70029.57
Organism:Homo sapiens (Human)
Description:P00734
Residue:622
BDBM50100967
NameBDBM50100967
Synonyms:CHEMBL101615
TypeSmall organic molecule
Emp. Form.C24H23N5O5S
Mol. Mass.493.535
SMILESCc1ccc(NS(=O)(=O)c2ccc3OCCc3c2)c(=O)n1CC(=O)NCc1ccc2c[nH]nc2c1