Reaction Details
TargetProthrombin
LigandBDBM50215305
Substrate/Competitorn/a
Meas. Tech.ChEMBL_209399 (CHEMBL811331)
Ki 26±n/a nM
Citation Cui, JJAraldi, GLReiner, JEReddy, KMKemp, SJHo, JZSiev, DVMamedova, LGibson, TSGaudette, JAMinami, NKAnderson, SMBradbury, AENolan, TGSemple, JE Non-covalent thrombin inhibitors featuring P3-heterocycles with P1-bicyclic arginine surrogates. Bioorg Med Chem Lett12:2925-30 (2002) Prothrombin
Name:Prothrombin
Type:Protein
Mol. Mass.:70029.57
Organism:Homo sapiens (Human)
Description:P00734
Residue:622
BDBM50215305
NameBDBM50215305
Synonyms:CHEMBL100443
TypeSmall organic molecule
Emp. Form.C24H25N7O3
Mol. Mass.459.5004
SMILESCc1cnc(NCC2(CC2)c2ccccn2)c(=O)n1CC(=O)NCc1ccc2c(N)noc2c1