Reaction Details
TargetProthrombin
LigandBDBM50215306
Substrate/Competitorn/a
Meas. Tech.ChEMBL_209399 (CHEMBL811331)
Ki 31±n/a nM
Citation Cui, JJAraldi, GLReiner, JEReddy, KMKemp, SJHo, JZSiev, DVMamedova, LGibson, TSGaudette, JAMinami, NKAnderson, SMBradbury, AENolan, TGSemple, JE Non-covalent thrombin inhibitors featuring P3-heterocycles with P1-bicyclic arginine surrogates. Bioorg Med Chem Lett12:2925-30 (2002) Prothrombin
Name:Prothrombin
Type:Protein
Mol. Mass.:70029.57
Organism:Homo sapiens (Human)
Description:P00734
Residue:622
BDBM50215306
NameBDBM50215306
Synonyms:CHEMBL100565
TypeSmall organic molecule
Emp. Form.C29H28N6O3
Mol. Mass.508.571
SMILESCc1cnc(NCC(c2ccccc2)c2ccccc2)c(=O)n1CC(=O)NCc1ccc2c(N)noc2c1