Reaction Details
TargetProthrombin
LigandBDBM50215307
Substrate/Competitorn/a
Meas. Tech.ChEMBL_209399 (CHEMBL811331)
Ki 1587±n/a nM
Citation Cui, JJAraldi, GLReiner, JEReddy, KMKemp, SJHo, JZSiev, DVMamedova, LGibson, TSGaudette, JAMinami, NKAnderson, SMBradbury, AENolan, TGSemple, JE Non-covalent thrombin inhibitors featuring P3-heterocycles with P1-bicyclic arginine surrogates. Bioorg Med Chem Lett12:2925-30 (2002) Prothrombin
Name:Prothrombin
Type:Protein
Mol. Mass.:70029.57
Organism:Homo sapiens (Human)
Description:P00734
Residue:622
BDBM50215307
NameBDBM50215307
Synonyms:CHEMBL99279
TypeSmall organic molecule
Emp. Form.C23H24N6O2
Mol. Mass.416.4757
SMILESCc1cnc(NCCc2ccccc2)c(=O)n1CC(=O)NCc1ccc2c[nH]nc2c1