Reaction Details
TargetProthrombin
LigandBDBM50215310
Substrate/Competitorn/a
Meas. Tech.ChEMBL_209399 (CHEMBL811331)
Ki 6.5±n/a nM
Citation Cui, JJAraldi, GLReiner, JEReddy, KMKemp, SJHo, JZSiev, DVMamedova, LGibson, TSGaudette, JAMinami, NKAnderson, SMBradbury, AENolan, TGSemple, JE Non-covalent thrombin inhibitors featuring P3-heterocycles with P1-bicyclic arginine surrogates. Bioorg Med Chem Lett12:2925-30 (2002) Prothrombin
Name:Prothrombin
Type:Protein
Mol. Mass.:70029.57
Organism:Homo sapiens (Human)
Description:P00734
Residue:622
BDBM50215310
NameBDBM50215310
Synonyms:CHEMBL97869
TypeSmall organic molecule
Emp. Form.C23H22ClN5O4S
Mol. Mass.499.97
SMILESCc1ccc(NS(=O)(=O)Cc2ccc(Cl)cc2)c(=O)n1CC(=O)NCc1ccc2[nH]cnc2c1