Reaction Details
TargetProthrombin
LigandBDBM50215311
Substrate/Competitorn/a
Meas. Tech.ChEMBL_209399 (CHEMBL811331)
Ki 9.0±n/a nM
Citation Cui, JJAraldi, GLReiner, JEReddy, KMKemp, SJHo, JZSiev, DVMamedova, LGibson, TSGaudette, JAMinami, NKAnderson, SMBradbury, AENolan, TGSemple, JE Non-covalent thrombin inhibitors featuring P3-heterocycles with P1-bicyclic arginine surrogates. Bioorg Med Chem Lett12:2925-30 (2002) Prothrombin
Name:Prothrombin
Type:Protein
Mol. Mass.:70029.57
Organism:Homo sapiens (Human)
Description:P00734
Residue:622
BDBM50215311
NameBDBM50215311
Synonyms:CHEMBL317140
TypeSmall organic molecule
Emp. Form.C26H29N7O3
Mol. Mass.487.5536
SMILESCOc1ccc(cc1)C1(CNc2ncc(C)n(CC(=O)NCc3ccc4[nH]nc(N)c4c3)c2=O)CC1