Reaction Details
TargetProthrombin
LigandBDBM50124087
Substrate/Competitorn/a
Meas. Tech.ChEMBL_209399 (CHEMBL811331)
Ki 17±n/a nM
Citation Cui, JJAraldi, GLReiner, JEReddy, KMKemp, SJHo, JZSiev, DVMamedova, LGibson, TSGaudette, JAMinami, NKAnderson, SMBradbury, AENolan, TGSemple, JE Non-covalent thrombin inhibitors featuring P3-heterocycles with P1-bicyclic arginine surrogates. Bioorg Med Chem Lett12:2925-30 (2002) Prothrombin
Name:Prothrombin
Type:Protein
Mol. Mass.:70029.57
Organism:Homo sapiens (Human)
Description:P00734
Residue:622
BDBM50124087
NameBDBM50124087
Synonyms:CHEMBL101563 | N-(1H-Benzoimidazol-5-ylmethyl)-2-(6-methyl-2-oxo-3-phenethylamino-2H-pyrazin-1-yl)-acetamide
TypeSmall organic molecule
Emp. Form.C23H24N6O2
Mol. Mass.416.4757
SMILESCc1cnc(NCCc2ccccc2)c(=O)n1CC(=O)NCc1ccc2nc[nH]c2c1