Reaction Details
TargetProthrombin
LigandBDBM50215439
Substrate/Competitorn/a
Meas. Tech.ChEMBL_209399 (CHEMBL811331)
Ki>3968±n/a nM
Citation Cui, JJAraldi, GLReiner, JEReddy, KMKemp, SJHo, JZSiev, DVMamedova, LGibson, TSGaudette, JAMinami, NKAnderson, SMBradbury, AENolan, TGSemple, JE Non-covalent thrombin inhibitors featuring P3-heterocycles with P1-bicyclic arginine surrogates. Bioorg Med Chem Lett12:2925-30 (2002) Prothrombin
Name:Prothrombin
Type:Protein
Mol. Mass.:70029.57
Organism:Homo sapiens (Human)
Description:P00734
Residue:622
BDBM50215439
NameBDBM50215439
Synonyms:CHEMBL100837
TypeSmall organic molecule
Emp. Form.C24H26N6O2
Mol. Mass.430.5022
SMILESCc1nc2cc(CNC(=O)Cn3c(C)cnc(NCCc4ccccc4)c3=O)ccc2[nH]1