Reaction Details
TargetSubstance-P receptor
LigandBDBM50217051
Substrate/Competitorn/a
Meas. Tech.ChEMBL_205899 (CHEMBL814483)
Ki 2291±n/a nM
Citation Bleicher, KHWüthrich, YAdam, GHoffmann, TSleight, AJ Parallel solution- and solid-phase synthesis of spiropyrrolo-pyrroles as novel neurokinin receptor ligands. Bioorg Med Chem Lett12:3073-6 (2002) Substance-P receptor
Name:Substance-P receptor
Type:G Protein-Coupled Receptor (GPCR)
Mol. Mass.:46254.43
Organism:Homo sapiens (Human)
Description:P25103
Residue:407
BDBM50217051
NameBDBM50217051
Synonyms:CHEMBL432007
TypeSmall organic molecule
Emp. Form.C28H27F6N3O4
Mol. Mass.583.5221
SMILESFC(F)(F)c1cc(CN2C(=O)C3CN(C(=O)COCc4ccccc4)C4(CCNCC4)C3C2=O)cc(c1)C(F)(F)F